Target
Carbonic anhydrase 4
Ligand
BDBM50079068
Substrate
Meas. Tech.
ChEBML_45432
Ki
125±n/a nM
Citation
 Scozzafava, ASupuran, CT Carbonic anhydrase inhibitors: synthesis of N-morpholylthiocarbonylsulfenylamino aromatic/heterocyclic sulfonamides and their interaction with isozymes I, II and IV. Bioorg Med Chem Lett 10:1117-20 (2000)  
Target
Name:
Carbonic anhydrase 4
Synonyms:
CA-IV CAH4_BOVIN Carbonic Anhydrase IV Carbonic anhydrase 4
Type:
Enzyme
Mol. Mass.:
35152.74
Organism:
Bos taurus (bovine)
Description:
Bovine isozyme, isolated from lung microsomes
Residue:
312
  
Inhibitor
Name:
BDBM50079068
Synonyms:
3-amino-N-(5-sulfamoyl-[1,3,4]thiadiazol-2-yl)-propionamide | CHEMBL13646
Type:
Small organic molecule
Emp. Form.:
C5H9N5O3S2
Mol. Mass.:
251.287
SMILES:
NCCC(=O)Nc1nnc(s1)S(N)(=O)=O
: