Target
Growth factor receptor-bound protein 2
Ligand
BDBM50089521
Substrate
Meas. Tech.
ChEBML_72352
IC50
2000±n/a nM
Citation
 Kim, HKNam, JYHan, MYSon, KHChoi, JDKwon, BMTakusagawa, HLHuang, YTakusagawa, F Natural and synthetic analogues of actinomycin D as Grb2-SH2 domain blockers. Bioorg Med Chem Lett 10:1455-7 (2000)  
Target
Name:
Growth factor receptor-bound protein 2
Synonyms:
Adapter protein GRB2 Grb2 | SH2/SH3 adapter GRB2
Type:
PROTEIN
Mol. Mass.:
25237.10
Organism:
Mus musculus
Description:
ChEMBL_72352
Residue:
217
  
Inhibitor
Name:
BDBM50089521
Synonyms:
Actinomycin D analogue | CHEMBL2372241
Type:
Small organic molecule
Emp. Form.:
C70H86N12O18
Mol. Mass.:
1383.5014
SMILES:
[H][C@@]12CCCN1C(=O)[C@H](NC(=O)[C@@H](NC(=O)c1ccc(C)c3oc4c(C)c(=O)c(N)c(C(=O)N[C@H]5[C@@H](C)OC(=O)[C@@H](Cc6ccc(OC)cc6)NC(=O)CN(C)C(=O)[C@]6([H])CCCN6C(=O)[C@H](NC5=O)C(C)C)c4nc13)[C@@H](C)OC(=O)[C@@H](Cc1ccc(OC)cc1)NC(=O)CN(C)C2=O)C(C)C
: