Target
Protein phosphatase 1B
Ligand
BDBM50090505
Substrate
Meas. Tech.
ChEBML_161763
IC50
1780±n/a nM
Citation
 McCluskey, ABowyer, MCCollins, ESim ATR, naSakoff, JABaldwin, ML Anhydride modified cantharidin analogues: synthesis, inhibition of protein phosphatases 1 and 2A and anticancer activity. Bioorg Med Chem Lett 10:1687-90 (2000)  
Target
Name:
Protein phosphatase 1B
Synonyms:
PP2C-beta PPM1B Protein phosphatase 1B Protein phosphatase 2C isoform beta
Type:
PROTEIN
Mol. Mass.:
52620.37
Organism:
Homo sapiens (Human)
Description:
ChEMBL_161756
Residue:
479
  
Inhibitor
Name:
BDBM50090505
Synonyms:
(1R,2S,6R,7S)-2,6-Dimethyl-4,10-dioxa-tricyclo[5.2.1.0*2,6*]decane-3,5-dione (1S,2R,6S,7R)-2,6-Dimethyl-4,10-dioxa-tricyclo[5.2.1.0*2,6*]decane-3,5-dione CANTHARIDIN cid_6708701
Type:
Small organic molecule
Emp. Form.:
C10H12O4
Mol. Mass.:
196.1999
SMILES:
C[C@]12[C@@H]3CC[C@@H](O3)[C@@]1(C)C(=O)OC2=O
: