Target
Glutamate receptor 2
Ligand
BDBM50091477
Substrate
Meas. Tech.
ChEBML_90153
Ki
3680±n/a nM
Citation
 Baker, SRBleakman, DEzquerra, JBallyk, BADeverill, MHo, KKamboj, RKCollado, IDomínguez, CEscribano, AMateo, AIPedregal, CRubio, A 4-Alkylidenyl glutamic acids, potent and selective GluR5 agonists. Bioorg Med Chem Lett 10:1807-10 (2000)  
Target
Name:
Glutamate receptor 2
Synonyms:
AMPA-selective glutamate receptor 2 GRIA2 GluR-2 GluR-K2 Glutamate receptor 2 Glutamate receptor AMPA 2/3 Glutamate receptor ionotropic, AMPA 2
Type:
Enzyme Catalytic Domain
Mol. Mass.:
98825.96
Organism:
Homo sapiens (Human)
Description:
Glutamate AMPA 2 GRIA2 HUMAN::P42262
Residue:
883
  
Inhibitor
Name:
BDBM50091477
Synonyms:
(S)-2-Amino-4-cyclopentylidene-pentanedioic acid LY-339624
Type:
Small organic molecule
Emp. Form.:
C10H15NO4
Mol. Mass.:
213.2304
SMILES:
[#7]-[#6@@H](-[#6]\[#6](-[#6](-[#8])=O)=[#6]-1\[#6]-[#6]-[#6]-[#6]-1)-[#6](-[#8])=O
: