Target
Alpha-1A adrenergic receptor
Ligand
BDBM50091720
Substrate
Meas. Tech.
ChEBML_33731
Ki
0.370000±n/a nM
Citation
 Barrow, JCGlass, KLSelnick, HGFreidinger, RMChang, RSO'Malley, SSWoyden, C Preparation and evaluation of 1,3-diaminocyclopentane-linked dihydropyrimidinone derivatives as selective alpha1a-receptor antagonists. Bioorg Med Chem Lett 10:1917-20 (2001)  
Target
Name:
Alpha-1A adrenergic receptor
Synonyms:
ADA1A_HUMAN ADRA1C Alpha 1A-adrenoceptor Alpha adrenergic receptor 1a Alpha-adrenergic receptor 1c adrenergic Alpha1 | adrenergic Alpha1C
Type:
Cell-surface receptors
Mol. Mass.:
51511.67
Organism:
Homo sapiens (Human)
Description:
P35348
Residue:
466
  
Inhibitor
Name:
BDBM50091720
Synonyms:
(S)-3-[(1R,3R)-3-(4-Cyano-4-phenyl-piperidin-1-yl)-cyclopentylcarbamoyl]-4-(3,4-difluoro-phenyl)-6-methoxymethyl-2-oxo-1,2,3,4-tetrahydro-pyrimidine-5-carboxylic acid methyl ester | CHEMBL433284
Type:
Small organic molecule
Emp. Form.:
C32H35F2N5O5
Mol. Mass.:
607.6476
SMILES:
COCC1=C([C@@H](N(C(=O)N[C@@H]2CC[C@H](C2)N2CCC(CC2)(C#N)c2ccccc2)C(=O)N1)c1ccc(F)c(F)c1)C(=O)OC
: