Target
Adenosine receptor A1
Ligand
BDBM50366652
Substrate
Meas. Tech.
ChEBML_29313
Ki
100±n/a nM
Citation
 Wanner, MJVon Frijtag Drabbe Künzel, JKIjzerman, APKoomen, GJ 2-Nitro analogues of adenosine and 1-deazaadenosine: synthesis and binding studies at the adenosine A1, A2A and A3 receptor subtypes. Bioorg Med Chem Lett 10:2141-4 (2000)  
Target
Name:
Adenosine receptor A1
Synonyms:
AA1R_RAT ADENOSINE A1 high Adenosine A1 receptor (A1) Adenosine receptors A1 | Adora1
Type:
Protein
Mol. Mass.:
36704.13
Organism:
Rattus norvegicus (rat)
Description:
Residue:
326
  
Inhibitor
Name:
BDBM50366652
Synonyms:
CHEMBL610646
Type:
Small organic molecule
Emp. Form.:
C16H22N4O4
Mol. Mass.:
334.3703
SMILES:
OC[C@H]1OC([C@H](O)[C@@H]1O)n1cnc2c(NC3CCCC3)nccc12
: