Target
Kappa-type opioid receptor
Ligand
BDBM50085025
Substrate
Meas. Tech.
ChEBML_146512
Ki
410±n/a nM
Citation
 Wentland, MPXu, GCioffi, CLYe, YDuan, WCohen, DJColasurdo, AMBidlack, JM 8-Aminocyclazocine analogues: synthesis and structure-activity relationships. Bioorg Med Chem Lett 10:183-7 (2000)  
Target
Name:
Kappa-type opioid receptor
Synonyms:
Kappa Opioid Receptor OPRK1 Opiate Kappa 1 | mu/kappa opioid receptor
Type:
G Protein-Coupled Receptor (GPCR)
Mol. Mass.:
42744.99
Organism:
Cavia porcellus (domestic guinea pig)
Description:
P41144
Residue:
380
  
Inhibitor
Name:
BDBM50085025
Synonyms:
(6S,11R)-3-Cyclopropylmethyl-6,11-dimethyl-8-pyrrolidin-1-yl-1,2,3,4,5,6-hexahydro-2,6-methano-benzo[d]azocine CHEMBL55948
Type:
Small organic molecule
Emp. Form.:
C22H32N2
Mol. Mass.:
324.5029
SMILES:
C[C@H]1C2Cc3ccc(cc3[C@@]1(C)CCN2CC1CC1)N1CCCC1
: