Target
Trypanothione reductase
Ligand
BDBM50093204
Substrate
Meas. Tech.
ChEBML_211803
Ki
1260±n/a nM
Citation
 Chitkul, BBradley, M Optimising inhibitors of trypanothione reductase using solid-phase chemistry. Bioorg Med Chem Lett 10:2367-9 (2001)  
Target
Name:
Trypanothione reductase
Synonyms:
N(1),N(8)-bis(glutathionyl)spermidine reductase TR | TYTR_TRYCR
Type:
Homodimer; oxidoreductase
Mol. Mass.:
53868.26
Organism:
Trypanosoma cruzi
Description:
Residue:
492
  
Inhibitor
Name:
BDBM50093204
Synonyms:
4-(1H-Indol-3-yl)-N-(3-{4-[3-(4-1H-indol-3-yl-butyrylamino)-propylamino]-butylamino}-propyl)-butyramide | CHEMBL77912
Type:
Small organic molecule
Emp. Form.:
C34H48N6O2
Mol. Mass.:
572.7839
SMILES:
O=C(CCCc1c[nH]c2ccccc12)NCCCNCCCCNCCCNC(=O)CCCc1c[nH]c2ccccc12
: