Target
M-phase inducer phosphatase 1
Ligand
BDBM50093973
Substrate
Meas. Tech.
ChEBML_49010
IC50
>300000±n/a nM
Citation
 Takahashi, MDodo, KSugimoto, YAoyagi, YYamada, YHashimoto, YShirai, R Synthesis of the novel analogues of dysidiolide and their structure-activity relationship. Bioorg Med Chem Lett 10:2571-4 (2001)  
Target
Name:
M-phase inducer phosphatase 1
Synonyms:
CDC25A Dual specificity phosphatase Cdc25A MPIP1_HUMAN | phosphatase Cdc25
Type:
Protein
Mol. Mass.:
59090.18
Organism:
Homo sapiens (Human)
Description:
P30304
Residue:
524
  
Inhibitor
Name:
BDBM50093973
Synonyms:
5-Hydroxy-4-[1-hydroxy-2-(1-methyl-cyclohexyl)-ethyl]-5H-furan-2-one | CHEMBL86451
Type:
Small organic molecule
Emp. Form.:
C13H20O4
Mol. Mass.:
240.2955
SMILES:
CC1(CC(O)C2=CC(=O)OC2O)CCCCC1
: