Target
Nitric oxide synthase, brain
Ligand
BDBM50086467
Substrate
Meas. Tech.
ChEBML_144065
IC50
145000±n/a nM
Citation
 Young, RJBeams, RMCarter, KClark, HACoe, DMChambers, CLDavies, PIDawson, JDrysdale, MJFranzman, KWFrench, CHodgson, STHodson, HFKleanthous, SRider, PSanders, DSawyer, DAScott, KJShearer, BGStocker, RSmith, STackley, MCKnowles, RG Inhibition of inducible nitric oxide synthase by acetamidine derivatives of hetero-substituted lysine and homolysine. Bioorg Med Chem Lett 10:597-600 (2000)  
Target
Name:
Nitric oxide synthase, brain
Synonyms:
Constitutive NOS NC-NOS NOS type I nNOS NOS1_HUMAN Neuronal nitric oxide synthase Nitric oxide synthase, neuronal (nNOS) bNOS | nNOS
Type:
Homodimer
Mol. Mass.:
160985.98
Organism:
Homo sapiens (Human)
Description:
P29475
Residue:
1434
  
Inhibitor
Name:
BDBM50086467
Synonyms:
(S)-4-(2-Acetimidoylamino-ethylsulfanyl)-2-amino-butyric acid | CHEMBL114551
Type:
Small organic molecule
Emp. Form.:
C8H17N3O2S
Mol. Mass.:
219.304
SMILES:
CC(=N)NCCSCC[C@H](N)C(O)=O
: