Target
Nitric oxide synthase, inducible
Ligand
BDBM50086470
Substrate
Meas. Tech.
ChEBML_89185
IC50
5900±n/a nM
Citation
 Young, RJBeams, RMCarter, KClark, HACoe, DMChambers, CLDavies, PIDawson, JDrysdale, MJFranzman, KWFrench, CHodgson, STHodson, HFKleanthous, SRider, PSanders, DSawyer, DAScott, KJShearer, BGStocker, RSmith, STackley, MCKnowles, RG Inhibition of inducible nitric oxide synthase by acetamidine derivatives of hetero-substituted lysine and homolysine. Bioorg Med Chem Lett 10:597-600 (2000)  
Target
Name:
Nitric oxide synthase, inducible
Synonyms:
HEP-NOS Inducible NO synthase NOS type II NOS2A Nitric oxide synthase, inducible (iNOS) | iNOS
Type:
Homodimer
Mol. Mass.:
131141.95
Organism:
Homo sapiens (Human)
Description:
P35228
Residue:
1153
  
Inhibitor
Name:
BDBM50086470
Synonyms:
(R)-4-(2-Acetimidoylamino-ethylsulfanyl)-2-amino-butyric acid | CHEMBL155316
Type:
Small organic molecule
Emp. Form.:
C8H17N3O2S
Mol. Mass.:
219.304
SMILES:
CC(=N)NCCSCC[C@@H](N)C(O)=O
: