Target
Alpha-2A adrenergic receptor
Ligand
BDBM50087152
Substrate
Meas. Tech.
ChEBML_33064
Ki
0.870000±n/a nM
Citation
 Zheng, WLei, LLalchandani, SSun, GFeller, DRMiller, DD Yohimbine dimers exhibiting binding selectivities for human alpha2a- versus alpha2b-adrenergic receptors. Bioorg Med Chem Lett 10:627-30 (2000)  
Target
Name:
Alpha-2A adrenergic receptor
Synonyms:
ADA2A_HUMAN ADRA2R Adrenergic alpha2A Alpha-2 adrenergic receptor subtype C10 Alpha-2A adrenoreceptor alpha-2A adrenergic receptor [Homo sapiens]
Type:
Enzyme
Mol. Mass.:
48979.91
Organism:
Homo sapiens (Human)
Description:
P08913
Residue:
465
  
Inhibitor
Name:
BDBM50087152
Synonyms:
1N-{7-[2-hydroxy-(1R,2S,4aR,13bS,14aS)-1,2,3,4,4a,5,7,8,13,13b,14,14a-dodecahydroisoquino[3,2-a]b-carbolin-1-ylcarboxamido]heptyl}-2-hydroxy-(1R,2S,4aR,13bS,14aS)-1,2,3,4,4a,5,7,8,13,13b,14,14a-dodecahydroisoquino[3, ;dihydrochloride | CHEMBL543232
Type:
Small organic molecule
Emp. Form.:
C47H62N6O4
Mol. Mass.:
775.033
SMILES:
O[C@H]1CC[C@H]2CN3CCc4c([nH]c5ccccc45)[C@@H]3C[C@@H]2[C@H]1C(=O)NCCCCCCCNC(=O)[C@H]1[C@@H](O)CC[C@H]2CN3CCc4c([nH]c5ccccc45)[C@@H]3C[C@H]12
: