Target
Fructose-1,6-bisphosphatase 1
Ligand
BDBM4626
Substrate
Meas. Tech.
ChEBML_157940
IC50
340±n/a nM
Citation
 Wright, SWHageman, DLMcClure, LDCarlo, AATreadway, JLMathiowetz, AMWithka, JMBauer, PH Allosteric inhibition of fructose-1,6-bisphosphatase by anilinoquinazolines. Bioorg Med Chem Lett 11:17-21 (2001)  
Target
Name:
Fructose-1,6-bisphosphatase 1
Synonyms:
F16P1_PIG FBP1 Fructose-1,6-bisphosphatase 1 (FBPase)
Type:
Protein
Mol. Mass.:
36781.07
Organism:
Sus scrofa (Pig)
Description:
Liver FBPase (P00636)
Residue:
338
  
Inhibitor
Name:
BDBM4626
Synonyms:
Anilinoquinazoline deriv. 9 N-(3-chloro-4-fluorophenyl)-6,7-dimethoxyquinazolin-4-amine
Type:
Small organic molecule
Emp. Form.:
C16H13ClFN3O2
Mol. Mass.:
333.745
SMILES:
COc1cc2ncnc(Nc3ccc(F)c(Cl)c3)c2cc1OC
: