Target
Fructose-1,6-bisphosphatase 1
Ligand
BDBM3032
Substrate
Meas. Tech.
ChEBML_86713
IC50
1000±n/a nM
Citation
 Wright, SWHageman, DLMcClure, LDCarlo, AATreadway, JLMathiowetz, AMWithka, JMBauer, PH Allosteric inhibition of fructose-1,6-bisphosphatase by anilinoquinazolines. Bioorg Med Chem Lett 11:17-21 (2001)  
Target
Name:
Fructose-1,6-bisphosphatase 1
Synonyms:
D-fructose-1,6-bisphosphate 1-phosphohydrolase 1 FBP FBPase 1 Fructose-1,6-bisphosphatase 1 | Fructose-1,6-bisphosphatase 1 (FBPase)
Type:
Protein
Mol. Mass.:
36843.58
Organism:
Homo sapiens (Human)
Description:
Liver FBPase (P09467)
Residue:
338
  
Inhibitor
Name:
BDBM3032
Synonyms:
CHEMBL1204168 N-(3-bromophenyl)-6,7-dimethoxyquinazolin-4-amine US11001595, Compound PD153035 US9422297, PD153035
Type:
Small organic molecule
Emp. Form.:
C16H14BrN3O2
Mol. Mass.:
360.205
SMILES:
COc1cc2ncnc(Nc3cccc(Br)c3)c2cc1OC
: