Target
Mu-type opioid receptor
Ligand
BDBM50101162
Substrate
Meas. Tech.
ChEBML_145276
Ki
440±n/a nM
Citation
 Wentland, MPLou, RDehnhardt, CMDuan, WCohen, DJBidlack, JM 3-Carboxamido analogues of morphine and naltrexone. synthesis and opioid receptor binding properties. Bioorg Med Chem Lett 11:1717-21 (2001)  
Target
Name:
Mu-type opioid receptor
Synonyms:
M-OR-1 Mu opioid receptor OPIATE Mu OPRM_CAVPO
Type:
Enzyme Catalytic Domain
Mol. Mass.:
11165.58
Organism:
GUINEA PIG
Description:
P97266
Residue:
98
  
Inhibitor
Name:
BDBM50101162
Synonyms:
4,10N-dimethyl-14-hydroxy-(1S,5R,17R)-12-oxa-4-azapentacyclo[9.6.1.01,13.05,17.07,18]octadeca-7,9,11(18),15-tetraene-10-carboxamide | CHEMBL49029
Type:
Small organic molecule
Emp. Form.:
C19H22N2O3
Mol. Mass.:
326.3896
SMILES:
CNC(=O)c1ccc2C[C@@H]3[C@@H]4C=CC(O)C5Oc1c2[C@]45CCN3C
: