Target
Delta-type opioid receptor
Ligand
BDBM50101162
Substrate
Meas. Tech.
ChEBML_145509
Ki
>10000±n/a nM
Citation
 Wentland, MPLou, RDehnhardt, CMDuan, WCohen, DJBidlack, JM 3-Carboxamido analogues of morphine and naltrexone. synthesis and opioid receptor binding properties. Bioorg Med Chem Lett 11:1717-21 (2001)  
Target
Name:
Delta-type opioid receptor
Synonyms:
D-OR-1 Delta opioid receptor OPIATE Delta OPRD1 OPRK1 | opioid receptor, delta 1
Type:
G Protein-Coupled Receptor (GPCR)
Mol. Mass.:
40382.98
Organism:
Homo sapiens (Human)
Description:
Competition binding assays were carried out using membrane preparations from transfected HN9.10 cells that constitutively expressed the delta opioid receptor.
Residue:
372
  
Inhibitor
Name:
BDBM50101162
Synonyms:
4,10N-dimethyl-14-hydroxy-(1S,5R,17R)-12-oxa-4-azapentacyclo[9.6.1.01,13.05,17.07,18]octadeca-7,9,11(18),15-tetraene-10-carboxamide | CHEMBL49029
Type:
Small organic molecule
Emp. Form.:
C19H22N2O3
Mol. Mass.:
326.3896
SMILES:
CNC(=O)c1ccc2C[C@@H]3[C@@H]4C=CC(O)C5Oc1c2[C@]45CCN3C
: