Target
Metabotropic glutamate receptor 2
Ligand
BDBM50102122
Substrate
Meas. Tech.
ChEMBL_106200 (CHEMBL713190)
EC50
2300±n/a nM
Citation
 Mukhopadhyaya, JKKozikowski, APGrajkowska, EPshenichkin, SWroblewski, JT Synthesis of N(1)-substituted analogues of (2R,4R)-4-amino-pyrrolidine-2,4-dicarboxylic acid as agonists, partial agonists, and antagonists of group II metabotropic glutamate receptors. Bioorg Med Chem Lett 11:1919-24 (2001)  
Target
Name:
Metabotropic glutamate receptor 2
Synonyms:
GRM2_RAT Grm2 | Mglur2
Type:
PROTEIN
Mol. Mass.:
95786.41
Organism:
Rattus norvegicus
Description:
ChEMBL_105034
Residue:
872
  
Inhibitor
Name:
BDBM50102122
Synonyms:
(2R,4R)-4-amino-1-(4-aminobenzyl)pyrrolidine-2,4-dicarboxylic acid trihydrochloride | CHEMBL541050
Type:
Small organic molecule
Emp. Form.:
C13H17N3O4
Mol. Mass.:
279.2918
SMILES:
Nc1ccc(CN2C[C@](N)(C[C@@H]2C(O)=O)C(O)=O)cc1
: