Target
Metabotropic glutamate receptor 3
Ligand
BDBM50102114
Substrate
Meas. Tech.
ChEMBL_106394 (CHEMBL717249)
EC50
7500±n/a nM
Citation
 Mukhopadhyaya, JKKozikowski, APGrajkowska, EPshenichkin, SWroblewski, JT Synthesis of N(1)-substituted analogues of (2R,4R)-4-amino-pyrrolidine-2,4-dicarboxylic acid as agonists, partial agonists, and antagonists of group II metabotropic glutamate receptors. Bioorg Med Chem Lett 11:1919-24 (2001)  
Target
Name:
Metabotropic glutamate receptor 3
Synonyms:
GRM3_RAT Grm3 glutamate receptor, metabotropic 3 precursor
Type:
Protein
Mol. Mass.:
98971.84
Organism:
Rattus norvegicus (Rat)
Description:
P31422
Residue:
879
  
Inhibitor
Name:
BDBM50102114
Synonyms:
(2R,4R)-4-amino-1-(4-hydroxybenzyl)pyrrolidine-2,4-dicarboxylic acid dihydrochloride | CHEMBL543568
Type:
Small organic molecule
Emp. Form.:
C13H16N2O5
Mol. Mass.:
280.2765
SMILES:
N[C@@]1(C[C@@H](N(Cc2ccc(O)cc2)C1)C(O)=O)C(O)=O
: