Target
Growth hormone secretagogue receptor type 1
Ligand
BDBM50102236
Substrate
Meas. Tech.
ChEBML_84953
IC50
128±n/a nM
Citation
 Palucki, BLFeighner, SDPong, SMcKee, KKHreniuk, DLTan, CHoward, ADVan der Ploeg, LHPatchett, AANargund, RP Spiro(indoline-3,4'-piperidine) growth hormone secretagogues as ghrelin mimetics. Bioorg Med Chem Lett 11:1955-7 (2001)  
Target
Name:
Growth hormone secretagogue receptor type 1
Synonyms:
GH-releasing peptide receptor GHS-R GHSR_HUMAN Ghrelin receptor | Ghrelin receptor 1a (GHS-R1a)
Type:
Receptor
Mol. Mass.:
41334.57
Organism:
Homo sapiens (Human)
Description:
Receptor binding studies use plasma membranes from LLC PK-1 cells transiently transfected with hGHSR1a.
Residue:
366
  
Inhibitor
Name:
BDBM50102236
Synonyms:
2-[1-aminomethylcarboxamido-2-hydroxy-(1S)-ethylcarboxamido]-3-[1-methylsulfonylspiro[2,3-dihydro-1H-indole-3,4'-(hexahydropyridine)]-1-yl]-3-oxo-(2R)-propyl octanoate; Trifluoroacatate | CHEMBL61292
Type:
Small organic molecule
Emp. Form.:
C29H45N5O8S
Mol. Mass.:
623.761
SMILES:
CCCCCCCC(=O)OC[C@@H](NC(=O)[C@H](CO)NC(=O)CN)C(=O)N1CCC2(CN(c3ccccc23)S(C)(=O)=O)CC1
: