Target
Sodium-dependent dopamine transporter
Ligand
BDBM50102935
Substrate
Meas. Tech.
ChEMBL_62502 (CHEMBL677559)
Ki
201±n/a nM
Citation
 Petukhov, PAZhang, MJohnson, KJTella, SRKozikowski, AP Sar studies of piperidine-based analogues of cocaine. Part 3: oxadiazoles. Bioorg Med Chem Lett 11:2079-83 (2001)  
Target
Name:
Sodium-dependent dopamine transporter
Synonyms:
DA transporter SC6A3_RAT Sodium-dependent dopamine transporter | Sodium-dependent dopamine transporter (DAT)
Type:
Multi-pass membrane protein
Mol. Mass.:
68749.45
Organism:
Rattus norvegicus (rat)
Description:
P23977
Residue:
619
  
Inhibitor
Name:
BDBM50102935
Synonyms:
(3R,4S)-4-(4-Chloro-phenyl)-1-methyl-3-(3-methyl-[1,2,4]oxadiazol-5-yl)-piperidine | CHEMBL65917
Type:
Small organic molecule
Emp. Form.:
C15H18ClN3O
Mol. Mass.:
291.776
SMILES:
CN1CC[C@@H]([C@H](C1)c1nc(C)no1)c1ccc(Cl)cc1
: