Target
Beta-glucosidase A
Ligand
BDBM50104296
Substrate
Meas. Tech.
ChEBML_37440
IC50
80000±n/a nM
Citation
 Popowycz, FGerber-Lemaire, SDemange, RRodriguez-García, EAsenjo, ATRobina, IVogel, P Derivatives of (2R,3R,4S)-2-aminomethylpyrrolidine-3,4-diol are selective alpha-mannosidase inhibitors. Bioorg Med Chem Lett 11:2489-93 (2001)  
Target
Name:
Beta-glucosidase A
Synonyms:
BGLS_CALSA | bglA
Type:
PROTEIN
Mol. Mass.:
53484.21
Organism:
Caldocellum saccharolyticum
Description:
ChEMBL_37437
Residue:
455
  
Inhibitor
Name:
BDBM50104296
Synonyms:
2-(2,2-Dihydroxy-ethyl)-pyrrolidine-3,4-diol | CHEMBL83278
Type:
Small organic molecule
Emp. Form.:
C6H13NO4
Mol. Mass.:
163.1717
SMILES:
OC(O)CC1NCC(O)C1O
: