Target
Beta-glucosidase
Ligand
BDBM50104308
Substrate
Meas. Tech.
ChEMBL_37432 (CHEMBL650048)
Ki
220000±n/a nM
Citation
 Popowycz, FGerber-Lemaire, SDemange, RRodriguez-García, EAsenjo, ATRobina, IVogel, P Derivatives of (2R,3R,4S)-2-aminomethylpyrrolidine-3,4-diol are selective alpha-mannosidase inhibitors. Bioorg Med Chem Lett 11:2489-93 (2001)  
Target
Name:
Beta-glucosidase
Synonyms:
Type:
PROTEIN
Mol. Mass.:
60428.49
Organism:
Prunus avium
Description:
ChEMBL_37428
Residue:
531
  
Inhibitor
Name:
BDBM50104308
Synonyms:
CHEMBL445624 | N-Benzyl-N-(3,4-dihydroxy-pyrrolidin-2-ylmethyl)-acetamide
Type:
Small organic molecule
Emp. Form.:
C14H20N2O3
Mol. Mass.:
264.3202
SMILES:
CC(=O)N(CC1NCC(O)C1O)Cc1ccccc1
: