Target
Beta-glucosidase A
Ligand
BDBM50104305
Substrate
Meas. Tech.
ChEMBL_37440 (CHEMBL648536)
Ki
120000±n/a nM
Citation
 Popowycz, FGerber-Lemaire, SDemange, RRodriguez-García, EAsenjo, ATRobina, IVogel, P Derivatives of (2R,3R,4S)-2-aminomethylpyrrolidine-3,4-diol are selective alpha-mannosidase inhibitors. Bioorg Med Chem Lett 11:2489-93 (2001)  
Target
Name:
Beta-glucosidase A
Synonyms:
BGLS_CALSA | bglA
Type:
PROTEIN
Mol. Mass.:
53484.21
Organism:
Caldocellum saccharolyticum
Description:
ChEMBL_37437
Residue:
455
  
Inhibitor
Name:
BDBM50104305
Synonyms:
2-{[(Imidazol-1-ylmethyl)-amino]-methyl}-pyrrolidine-3,4-diol | CHEMBL82895
Type:
Small organic molecule
Emp. Form.:
C9H16N4O2
Mol. Mass.:
212.2489
SMILES:
OC1CNC(CNCn2ccnc2)C1O
: