Target
Beta-galactosidase
Ligand
BDBM50402978
Substrate
Meas. Tech.
ChEBML_37300
IC50
720000±n/a nM
Citation
 Popowycz, FGerber-Lemaire, SDemange, RRodriguez-García, EAsenjo, ATRobina, IVogel, P Derivatives of (2R,3R,4S)-2-aminomethylpyrrolidine-3,4-diol are selective alpha-mannosidase inhibitors. Bioorg Med Chem Lett 11:2489-93 (2001)  
Target
Name:
Beta-galactosidase
Synonyms:
Acid beta-galactosidase ELNR1 GLB1 | Lactase
Type:
PROTEIN
Mol. Mass.:
76074.43
Organism:
Homo sapiens (Human)
Description:
ChEMBL_215886
Residue:
677
  
Inhibitor
Name:
BDBM50402978
Synonyms:
CHEMBL2207396
Type:
Small organic molecule
Emp. Form.:
C4H9NO2
Mol. Mass.:
103.1198
SMILES:
O[C@H]1CNC[C@H]1O
: