Target
Tissue alpha-L-fucosidase
Ligand
BDBM50104397
Substrate
Meas. Tech.
ChEMBL_33963 (CHEMBL649588)
Ki
3000±n/a nM
Citation
 Robina, IMoreno-Vargas, AJFernández-Bolaños, JGFuentes, JDemange, RVogel, P New leads for selective inhibitors of alpha-L-fucosidases. Synthesis and glycosidase inhibitory activities of [(2R,3S,4R)-3,4-dihydroxypyrrolidin-2-yl]furan derivatives. Bioorg Med Chem Lett 11:2555-9 (2001)  
Target
Name:
Tissue alpha-L-fucosidase
Synonyms:
Alpha-L-fucosidase I FUCA1 Tissue alpha-L-fucosidase
Type:
PROTEIN
Mol. Mass.:
53690.69
Organism:
Homo sapiens (Human)
Description:
ChEMBL_34088
Residue:
466
  
Inhibitor
Name:
BDBM50104397
Synonyms:
5-(3,4-Dihydroxy-pyrrolidin-2-yl)-2-methyl-furan-3-carboxylic acid isopropylamide | CHEMBL75265
Type:
Small organic molecule
Emp. Form.:
C13H20N2O4
Mol. Mass.:
268.3089
SMILES:
CC(C)NC(=O)c1cc(oc1C)C1NCC(O)C1O
: