Target
Tissue alpha-L-fucosidase
Ligand
BDBM50104405
Substrate
Meas. Tech.
ChEBML_34082
Ki
10±n/a nM
Citation
 Robina, IMoreno-Vargas, AJFernández-Bolaños, JGFuentes, JDemange, RVogel, P New leads for selective inhibitors of alpha-L-fucosidases. Synthesis and glycosidase inhibitory activities of [(2R,3S,4R)-3,4-dihydroxypyrrolidin-2-yl]furan derivatives. Bioorg Med Chem Lett 11:2555-9 (2001)  
Target
Name:
Tissue alpha-L-fucosidase
Synonyms:
Alpha-L-fucosidase I FUCA1 Tissue alpha-L-fucosidase
Type:
PROTEIN
Mol. Mass.:
53690.69
Organism:
Homo sapiens (Human)
Description:
ChEMBL_34088
Residue:
466
  
Inhibitor
Name:
BDBM50104405
Synonyms:
3,4-Dihydroxy-5-methyl-pyrrolidine-2-sulfonic acid | CHEMBL84647
Type:
Small organic molecule
Emp. Form.:
C5H11NO5S
Mol. Mass.:
197.21
SMILES:
CC1NC(C(O)C1O)S(O)(=O)=O
: