Target
Neutrophil elastase
Ligand
BDBM50096483
Substrate
Meas. Tech.
ChEMBL_220434 (CHEMBL842599)
IC50
3±n/a nM
Citation
 Macdonald, SJDowle, MDHarrison, LASpooner, JEShah, PJohnson, MRInglis, GGClarke, GDBelton, DJSmith, RAMolloy, CRDixon, MMurkitt, GGodward, RESkarzynski, TSingh, OMKumar, KAHodgson, STMcDonald, EHardy, GWFinch, HHumphreys, DCFleetwood, G Intracellular inhibition of human neutrophil elastase by orally active pyrrolidine-trans-lactams. Bioorg Med Chem Lett 11:243-6 (2001)  
Target
Name:
Neutrophil elastase
Synonyms:
Bone marrow serine protease Coagulation factor X ELANE Elastase HLE Leukocyte elastase Medullasin Neutrophil elastase (HNE) PMN elastase Trypsin
Type:
Enzyme
Mol. Mass.:
28532.38
Organism:
Homo sapiens (Human)
Description:
P08246
Residue:
267
  
Inhibitor
Name:
BDBM50096483
Synonyms:
(3R,6aS)-1-Methanesulfonyl-4-(3-piperidin-1-yl-propionyl)-3-propyl-hexahydro-pyrrolo[3,2-b]pyrrol-2-one | CHEMBL2368634
Type:
Small organic molecule
Emp. Form.:
C18H32ClN3O4S
Mol. Mass.:
421.982
SMILES:
Cl.[H][C@]12CCN(C(=O)CCN3CCCCC3)[C@]1([H])[C@@H](CCC)C(=O)N2S(C)(=O)=O
: