Target
Delta-type opioid receptor
Ligand
BDBM50105773
Substrate
Meas. Tech.
ChEBML_147336
Ki
44±n/a nM
Citation
 Ullrich, TDersch, CMRothman, RBJacobson, AERice, KC Derivatives of 17-(2-methylallyl)-substituted noroxymorphone: variation of the delta address and its effects on affinity and selectivity for the delta opioid receptor. Bioorg Med Chem Lett 11:2883-5 (2001)  
Target
Name:
Delta-type opioid receptor
Synonyms:
D-OR-1 Delta opioid receptor OPIATE Delta OPRD1 OPRK1 | opioid receptor, delta 1
Type:
G Protein-Coupled Receptor (GPCR)
Mol. Mass.:
40382.98
Organism:
Homo sapiens (Human)
Description:
Competition binding assays were carried out using membrane preparations from transfected HN9.10 cells that constitutively expressed the delta opioid receptor.
Residue:
372
  
Inhibitor
Name:
BDBM50105773
Synonyms:
17-(2-methylallyl)-substituted noroxymorphone derivative | CHEMBL95408
Type:
Small organic molecule
Emp. Form.:
C27H27NO4
Mol. Mass.:
429.5076
SMILES:
COc1ccc2CC3N(CC(C)=C)CCC45[C@@H](Oc1c24)c1oc2ccccc2c1C[C@@]35O
: