Target
Metabotropic glutamate receptor 2
Ligand
BDBM50107109
Substrate
Meas. Tech.
ChEMBL_106053 (CHEMBL718219)
Ki
2700±n/a nM
Citation
 Pellicciari, RCostantino, GMarinozzi, MMacchiarulo, AAmori, LJosef Flor, PGasparini, FKuhn, RUrwyler, S Design, synthesis and preliminary evaluation of novel 3'-substituted carboxycyclopropylglycines as antagonists at group 2 metabotropic glutamate receptors. Bioorg Med Chem Lett 11:3179-82 (2001)  
Target
Name:
Metabotropic glutamate receptor 2
Synonyms:
GPRC1B GRM2_HUMAN Metabotropic glutamate receptor mGlu2 | metabotropic glutamate 2
Type:
Enzyme
Mol. Mass.:
95584.88
Organism:
Homo sapiens (Human)
Description:
Q14416
Residue:
872
  
Inhibitor
Name:
BDBM50107109
Synonyms:
(1S,2S,3R)-2-(Amino-carboxy-methyl)-3-(9H-xanthen-9-ylmethyl)-cyclopropanecarboxylic acid | CHEMBL108735
Type:
Small organic molecule
Emp. Form.:
C20H19NO5
Mol. Mass.:
353.3686
SMILES:
NC([C@H]1[C@@H](CC2c3ccccc3Oc3ccccc23)[C@@H]1C(O)=O)C(O)=O
: