Target
Neuronal acetylcholine receptor subunit alpha-4/beta-2
Ligand
BDBM50000483
Substrate
Meas. Tech.
ChEMBL_143884 (CHEMBL751867)
Ki
38000±n/a nM
Citation
 Macor, JEGurley, DLanthorn, TLoch, JMack, RAMullen, GTran, OWright, NGordon, JC The 5-HT3 antagonist tropisetron (ICS 205-930) is a potent and selective alpha7 nicotinic receptor partial agonist. Bioorg Med Chem Lett 11:319-21 (2001)  
Target
Name:
Neuronal acetylcholine receptor subunit alpha-4/beta-2
Synonyms:
Neuronal acetylcholine receptor Alpha-4/Beta-2 Neuronal acetylcholine receptor; alpha4/beta2 | nAChR subtypes alpha4 beta2
Type:
Protein
Mol. Mass.:
Description:
Components:
This complex has 2 components.
Component 1
Name:
Neuronal acetylcholine receptor subunit alpha-4
Synonyms:
ACHA4_HUMAN CHRNA4 protein Neuronal acetylcholine receptor protein alpha-4 subunit Nicotinic acetylcholine receptor alpha4/beta2/alpha5
Type:
Mol. Mass.:
69963.49
Organism:
Homo sapiens (Human)
Description:
NACHRA4
Residue:
627
  
Component 2
Name:
Neuronal acetylcholine receptor subunit beta-2
Synonyms:
ACHB2_HUMAN Neuronal acetylcholine receptor protein beta-2 subunit | Nicotinic acetylcholine receptor alpha3/beta2/alpha5
Type:
Protein
Mol. Mass.:
57020.50
Organism:
Homo sapiens (Human)
Description:
P17787
Residue:
502
  
Inhibitor
Name:
BDBM50000483
Synonyms:
(BRL 43694)1-Methyl-1H-indazole-3-carboxylic acid (9-methyl-9-aza-bicyclo[3.3.1]non-3-yl)-amide 1-Methyl-1H-indazole-3-carboxylic acid (8-methyl-8-aza-bicyclo[3.2.1]oct-3-yl)-amide 1-Methyl-1H-indazole-3-carboxylic acid (9-methyl-9-aza-bicyclo[3.3.1]non-3-yl)-amide(BRL 43694) 1-methyl-N-((1S,5R)-9-methyl-9-aza-bicyclo[3.3.1]nonan-3-yl)-1H-indazole-3-carboxamide BRL 43694 CHEMBL519643 LY-278584
Type:
Small organic molecule
Emp. Form.:
C18H24N4O
Mol. Mass.:
312.4094
SMILES:
CN1C2CCCC1CC(C2)NC(=O)c1nn(C)c2ccccc12
: