Target
Adenosine receptor A1
Ligand
BDBM50039676
Substrate
Meas. Tech.
ChEBML_29331
Ki
12±n/a nM
Citation
 van Muijlwijk-Koezen, JETimmerman, Hvan der Sluis, RPvan de Stolpe, ACMenge, WMBeukers, MWvan der Graaf, PHde Groote, MIJzerman, AP Synthesis and use of FSCPX, an irreversible adenosine A1 antagonist, as a 'receptor knock-down' tool. Bioorg Med Chem Lett 11:815-8 (2001)  
Target
Name:
Adenosine receptor A1
Synonyms:
AA1R_RAT ADENOSINE A1 high Adenosine A1 receptor (A1) Adenosine receptors A1 | Adora1
Type:
Protein
Mol. Mass.:
36704.13
Organism:
Rattus norvegicus (rat)
Description:
Residue:
326
  
Inhibitor
Name:
BDBM50039676
Synonyms:
4-Fluorosulfonyl-benzoic acid 3-(8-cyclopentyl-2,6-dioxo-1-propyl-1,2,6,7-tetrahydro-purin-3-yl)-propyl ester CHEMBL327708
Type:
Small organic molecule
Emp. Form.:
C23H27FN4O6S
Mol. Mass.:
506.547
SMILES:
CCCn1c(=O)n(CCCOC(=O)c2ccc(cc2)S(F)(=O)=O)c2nc([nH]c2c1=O)C1CCCC1
: