Target
Steryl-sulfatase
Ligand
BDBM50098106
Substrate
Meas. Tech.
ChEBML_68019
IC50
>100000000±n/a nM
Citation
 Ahmed, SOwen, CPJames, KPatel, CKPatel, M Acid dissociation constant, a potential physicochemical factor in the inhibition of the enzyme estrone sulfatase (ES). Bioorg Med Chem Lett 11:899-902 (2001)  
Target
Name:
Steryl-sulfatase
Synonyms:
ARSC1 Arylsulfatase C STS_HUMAN Steryl-sulfate sulfohydrolase
Type:
Enzyme
Mol. Mass.:
65503.66
Organism:
Homo sapiens (Human)
Description:
P08842
Residue:
583
  
Inhibitor
Name:
BDBM50098106
Synonyms:
CHEMBL24259 Sulfamic acid phenyl ester | phenyl sulfamate
Type:
Small organic molecule
Emp. Form.:
C6H7NO3S
Mol. Mass.:
173.19
SMILES:
NS(=O)(=O)Oc1ccccc1
: