Target
Alpha-1A adrenergic receptor
Ligand
BDBM50099327
Substrate
Meas. Tech.
ChEBML_33587
Ki
0.248000±n/a nM
Citation
 Carroll, WASippy, KBEsbenshade, TABuckner, SAHancock, AAMeyer, MD Two novel and potent 3-[(o-methoxyphenyl)piperazinylethyl]-5-phenylthien. Bioorg Med Chem Lett 11:1119-21 (2001)  
Target
Name:
Alpha-1A adrenergic receptor
Synonyms:
ADA1A_BOVIN ADRA1C Alpha 1A-adrenoreceptor Cerebral cortex alpha adrenergic receptor | adrenergic Alpha1
Type:
Enzyme Catalytic Domain
Mol. Mass.:
51492.08
Organism:
CALF
Description:
adrenergic Alpha1 0 CALF
Residue:
466
  
Inhibitor
Name:
BDBM50099327
Synonyms:
3-{2-[4-(2-Methoxy-phenyl)-piperazin-1-yl]-ethyl}-6-phenyl-1H-thieno[2,3-d]pyrimidine-2,4-dione | CHEMBL13903
Type:
Small organic molecule
Emp. Form.:
C25H26N4O3S
Mol. Mass.:
462.564
SMILES:
COc1ccccc1N1CCN(CCn2c(=O)[nH]c3sc(cc3c2=O)-c2ccccc2)CC1
: