Target
Substance-P receptor
Ligand
BDBM50366786
Substrate
Meas. Tech.
ChEBML_208822
Ki
1±n/a nM
Citation
 Ting, PCLee, JFShih, NYPiwinski, JJAnthes, JCChapman, RWRizzo, CAHey, JANg, KNomeir, AA Identification of a novel 1'-[5-((3,5-dichlorobenzoyl)methylamino)-3-(3,4-dichlorophenyl)-4-(methoxyimino)pentyl]-2-oxo-(1,4'-bipiperidine) as a dual NK(1)/NK(2) antagonist. Bioorg Med Chem Lett 12:2125-8 (2002)  
Target
Name:
Substance-P receptor
Synonyms:
NK1R_CAVPO Neurokinin NK1 TACR1
Type:
Enzyme Catalytic Domain
Mol. Mass.:
46261.42
Organism:
GUINEA PIG
Description:
Neurokinin NK1 TACR1 GUINEA PIG::P30547
Residue:
407
  
Inhibitor
Name:
BDBM50366786
Synonyms:
CHEMBL540651
Type:
Small organic molecule
Emp. Form.:
C36H46Cl4N5O4S
Mol. Mass.:
786.658
SMILES:
CO\N=C(/CN(C)C(=O)c1cc(Cl)cc(Cl)c1)C(CCN1CCC(CC1)N1CCCC(CC(=O)[S+]2CCNCC2)C1=O)c1ccc(Cl)c(Cl)c1
: