Target
cAMP-specific 3',5'-cyclic phosphodiesterase 4A/4B/4C/4D
Ligand
BDBM50116713
Substrate
Meas. Tech.
ChEMBL_157364 (CHEMBL762040)
IC50
18710±n/a nM
Citation
 Shin, HJKim, HJKwak, JHChun, HOKim, JHPark, HKim, DHLee, YS A prenylated flavonol, sophoflavescenol: a potent and selective inhibitor of cGMP phosphodiesterase 5. Bioorg Med Chem Lett 12:2313-6 (2002)  
Target
Name:
cAMP-specific 3',5'-cyclic phosphodiesterase 4A/4B/4C/4D
Synonyms:
Phosphodiesterase 4
Type:
Mol. Mass.:
Description:
ASSAY_ID of ChEMBL is 193660
Components:
This complex has 4 components.
Component 1
Name:
cAMP-specific 3',5'-cyclic phosphodiesterase 4B
Synonyms:
DPDE4 Pde4b | Phosphodiesterase 4B
Type:
Enzyme Catalytic Domain
Mol. Mass.:
83349.50
Organism:
RAT
Description:
P14646
Residue:
736
  
Component 2
Name:
cAMP-specific 3',5'-cyclic phosphodiesterase 4D
Synonyms:
DPDE3 Pde4d
Type:
PROTEIN
Mol. Mass.:
90531.57
Organism:
Rattus norvegicus
Description:
ChEMBL_104732
Residue:
803
  
Component 3
Name:
cAMP-specific 3',5'-cyclic phosphodiesterase 4A
Synonyms:
DPDE2 Pde4a
Type:
PROTEIN
Mol. Mass.:
93412.58
Organism:
Rattus norvegicus
Description:
ChEMBL_104732
Residue:
844
  
Component 4
Name:
cAMP-specific 3',5'-cyclic phosphodiesterase 4C
Synonyms:
Dpde1 Pde4c
Type:
PROTEIN
Mol. Mass.:
60038.21
Organism:
Rattus norvegicus
Description:
ChEMBL_104732
Residue:
536
  
Inhibitor
Name:
BDBM50116713
Synonyms:
(2R,3R)-2-(2,4-Dihydroxy-phenyl)-3,7-dihydroxy-8-(5-hydroxy-2-isopropenyl-5-methyl-hexyl)-5-methoxy-chroman-4-one | CHEMBL77703
Type:
Small organic molecule
Emp. Form.:
C26H32O8
Mol. Mass.:
472.5275
SMILES:
COc1cc(O)c(CC(CCC(C)(C)O)C(C)=C)c2O[C@@H]([C@@H](O)C(=O)c12)c1ccc(O)cc1O
: