Target
Acetylcholinesterase
Ligand
BDBM50117601
Substrate
Meas. Tech.
ChEMBL_28291 (CHEMBL644831)
IC50
2670±n/a nM
Citation
 Palin, RClark, JKCowley, PMuir, AWPow, EProsser, ABTaylor, RZhang, MQ Novel piperidinium and pyridinium agents as water-soluble acetylcholinesterase inhibitors for the reversal of neuromuscular blockade. Bioorg Med Chem Lett 12:2569-72 (2002)  
Target
Name:
Acetylcholinesterase
Synonyms:
ACES_HUMAN Acetylcholinesterase (AChE) | Acetylcholinesterase (human AChE)
Type:
Enzyme
Mol. Mass.:
67792.70
Organism:
Homo sapiens (Human)
Description:
P22303
Residue:
614
  
Inhibitor
Name:
BDBM50117601
Synonyms:
1-Benzyl-4-(5,6-dimethoxy-benzo[b]thiophen-2-ylmethylene)-1-methyl-piperidinium; bromide | CHEMBL87550
Type:
Small organic molecule
Emp. Form.:
C24H28NO2S
Mol. Mass.:
394.549
SMILES:
COc1cc2cc(C=C3CC[N+](C)(Cc4ccccc4)CC3)sc2cc1OC
: