Target
Protein farnesyltransferase subunit beta/geranylgeranyltransferase type-1 subunit alpha
Ligand
BDBM50108511
Substrate
Meas. Tech.
ChEMBL_69984 (CHEMBL682930)
IC50
449000±n/a nM
Citation
 Marson, CMRioja, ASBrooke, GCoombes, RCVigushin, DM Cyclic acid anhydrides as a new class of potent, selective and non-peptidic inhibitors of geranylgeranyl transferase. Bioorg Med Chem Lett 12:255-9 (2001)  
Target
Name:
Protein farnesyltransferase subunit beta/geranylgeranyltransferase type-1 subunit alpha
Synonyms:
Farnesyltransferase (FTase) Protein Farnesyltransferase (PFT) Chain B | Protein farnesyltransferase
Type:
Protein Complex
Mol. Mass.:
Description:
To express recombinant enzyme in E. coli, the cloned human alpha and beta subunits were co-expressed from a plasmid, in which their expression was translationally coupled.
Components:
This complex has 2 components.
Component 1
Name:
Protein farnesyltransferase subunit beta
Synonyms:
CAAX farnesyltransferase subunit alpha FNTB FTase-alpha GGTase-I-alpha Protein farnesyl/geranylgeranyl transferase Protein farnesyltransferase subunit beta Protein farnesyltransferase/geranylgeranyltransferase type-1 subunit alpha Ras proteins prenyltransferase subunit beta | Type I protein geranyl-geranyltransferase subunit alpha
Type:
Enzyme Subunit
Mol. Mass.:
48766.02
Organism:
Homo sapiens (Human)
Description:
Protein farnesyltransferase subunit beta
Residue:
437
  
Component 2
Name:
Protein farnesyltransferase/geranylgeranyltransferase type-1 subunit alpha
Synonyms:
CAAX farnesyltransferase alpha subunit FNTA_HUMAN FTase-alpha Geranylgeranyl Transferase (GGTase-I) Chain A Protein Farnesyltransferase (PFT) Chain A Protein farnesyltransferase Protein farnesyltransferase/geranylgeranyltransferase type I alpha subunit | Ras proteins prenyltransferase alpha
Type:
Enzyme
Mol. Mass.:
44392.46
Organism:
Homo sapiens (Human)
Description:
Recombinant human FTase.
Residue:
379
  
Inhibitor
Name:
BDBM50108511
Synonyms:
5-(4-Methyl-pent-3-enyl)-3a,4,7,7a-tetrahydro-isobenzofuran-1,3-dione | CHEMBL85858
Type:
Small organic molecule
Emp. Form.:
C14H18O3
Mol. Mass.:
234.2909
SMILES:
[#6]\[#6](-[#6])=[#6]\[#6]-[#6]-[#6]-1=[#6]-[#6]-[#6]-2-[#6](-[#6]-1)-[#6](=O)-[#8]-[#6]-2=O
: