Target
Tissue alpha-L-fucosidase
Ligand
BDBM50403994
Substrate
Meas. Tech.
ChEBML_33957
Ki
1000±n/a nM
Citation
 Ogawa, SMori, MTakeuchi, GDoi, FWatanabe, MSakata, Y Convenient synthesis and evaluation of enzyme inhibitory activity of several N-alkyl-, N-phenylalkyl, and cyclic isourea derivatives of 5a-carba-alpha-DL-fucopyranosylamine. Bioorg Med Chem Lett 12:2811-4 (2002)  
Target
Name:
Tissue alpha-L-fucosidase
Synonyms:
Alpha-L-fucosidase I FUCA1 Tissue alpha-L-fucosidase
Type:
PROTEIN
Mol. Mass.:
53690.69
Organism:
Homo sapiens (Human)
Description:
ChEMBL_34088
Residue:
466
  
Inhibitor
Name:
BDBM50403994
Synonyms:
CHEMBL2114287
Type:
Small organic molecule
Emp. Form.:
C7H15NO3
Mol. Mass.:
161.1989
SMILES:
C[C@@H]1C[C@@H](N)[C@@H](O)[C@H](O)[C@@H]1O
: