Target
Tissue alpha-L-fucosidase
Ligand
BDBM50065258
Substrate
Meas. Tech.
ChEBML_33957
Ki
31±n/a nM
Citation
 Ogawa, SMori, MTakeuchi, GDoi, FWatanabe, MSakata, Y Convenient synthesis and evaluation of enzyme inhibitory activity of several N-alkyl-, N-phenylalkyl, and cyclic isourea derivatives of 5a-carba-alpha-DL-fucopyranosylamine. Bioorg Med Chem Lett 12:2811-4 (2002)  
Target
Name:
Tissue alpha-L-fucosidase
Synonyms:
Alpha-L-fucosidase I FUCA1 Tissue alpha-L-fucosidase
Type:
PROTEIN
Mol. Mass.:
53690.69
Organism:
Homo sapiens (Human)
Description:
ChEMBL_34088
Residue:
466
  
Inhibitor
Name:
BDBM50065258
Synonyms:
(2S,3R,4S,5R)-2-Methyl-piperidine-3,4,5-triol CHEMBL314772 | Fucosidase Inhibitor, 3
Type:
Small organic molecule
Emp. Form.:
C6H13NO3
Mol. Mass.:
147.1723
SMILES:
C[C@@H]1NC[C@@H](O)[C@H](O)[C@@H]1O
: