Target
Dipeptidyl peptidase 2
Ligand
BDBM50243412
Substrate
Meas. Tech.
ChEMBL_53193 (CHEMBL666572)
IC50
>500000±n/a nM
Citation
 Senten, KVan der Veken, PBal, GDe Meester, ILambeir, AMScharpé, SBauvois, BHaemers, AAugustyns, K Development of potent and selective dipeptidyl peptidase II inhibitors. Bioorg Med Chem Lett 12:2825-8 (2002)  
Target
Name:
Dipeptidyl peptidase 2
Synonyms:
DAP II DPP2_HUMAN Dipeptidyl aminopeptidase II Dipeptidyl peptidase 2 (DPP2) Dipeptidyl peptidase II (DPP II) Dipeptidyl peptidase II and dipeptidyl peptidase IV (DPP2 and DPP4) carboxytripeptidase dipeptidyl(amino)peptidase II | dipeptidylarylamidase
Type:
Protein
Mol. Mass.:
54339.29
Organism:
Homo sapiens (Human)
Description:
Q9UHL4
Residue:
492
  
Inhibitor
Name:
BDBM50243412
Synonyms:
(S)-3-amino-4-oxo-4-(pyrrolidin-1-yl)butanoic acid | CHEMBL499101
Type:
Small organic molecule
Emp. Form.:
C8H14N2O3
Mol. Mass.:
186.2084
SMILES:
N[C@@H](CC(O)=O)C(=O)N1CCCC1
: