Target
Dipeptidyl peptidase 2
Ligand
BDBM50118935
Substrate
Meas. Tech.
ChEBML_53193
IC50
328±n/a nM
Citation
 Senten, KVan der Veken, PBal, GDe Meester, ILambeir, AMScharpé, SBauvois, BHaemers, AAugustyns, K Development of potent and selective dipeptidyl peptidase II inhibitors. Bioorg Med Chem Lett 12:2825-8 (2002)  
Target
Name:
Dipeptidyl peptidase 2
Synonyms:
DAP II DPP2_HUMAN Dipeptidyl aminopeptidase II Dipeptidyl peptidase 2 (DPP2) Dipeptidyl peptidase II (DPP II) Dipeptidyl peptidase II and dipeptidyl peptidase IV (DPP2 and DPP4) carboxytripeptidase dipeptidyl(amino)peptidase II | dipeptidylarylamidase
Type:
Protein
Mol. Mass.:
54339.29
Organism:
Homo sapiens (Human)
Description:
Q9UHL4
Residue:
492
  
Inhibitor
Name:
BDBM50118935
Synonyms:
2-Amino-3-(1H-imidazol-4-yl)-1-piperidin-1-yl-propan-1-one | CHEMBL97180
Type:
Small organic molecule
Emp. Form.:
C11H18N4O
Mol. Mass.:
222.2868
SMILES:
NC(Cc1cnc[nH]1)C(=O)N1CCCCC1
: