Target
Dipeptidyl peptidase 4
Ligand
BDBM50118947
Substrate
Meas. Tech.
ChEBML_53195
IC50
39000±n/a nM
Citation
 Senten, KVan der Veken, PBal, GDe Meester, ILambeir, AMScharpé, SBauvois, BHaemers, AAugustyns, K Development of potent and selective dipeptidyl peptidase II inhibitors. Bioorg Med Chem Lett 12:2825-8 (2002)  
Target
Name:
Dipeptidyl peptidase 4
Synonyms:
ADABP Adenosine deaminase complexing protein 2 CD_antigen=CD26 DPP4 DPPIV Dipeptidyl peptidase 4 (DPP IV) Dipeptidyl peptidase 4 (DPP4) Dipeptidyl peptidase 4 membrane form Dipeptidyl peptidase IV Dipeptidyl peptidase IV (DDP-IV) Dipeptidyl peptidase IV membrane form Dipeptidyl peptidase-IV (DPP-4) T-cell activation antigen CD26 | TP103
Type:
Enzyme
Mol. Mass.:
88271.01
Organism:
Homo sapiens (Human)
Description:
P27487
Residue:
766
  
Inhibitor
Name:
BDBM50118947
Synonyms:
2,6-Diamino-1-pyrrolidin-1-yl-hexan-1-one | CHEMBL328694
Type:
Small organic molecule
Emp. Form.:
C10H21N3O
Mol. Mass.:
199.2932
SMILES:
NCCCCC(N)C(=O)N1CCCC1
: