Target
Neuronal acetylcholine receptor subunit alpha-4/beta-2
Ligand
BDBM50119796
Substrate
Meas. Tech.
ChEMBL_143712 (CHEMBL756011)
Ki
39300±n/a nM
Citation
 Ayers, JTDwoskin, LPDeaciuc, AGGrinevich, VPZhu, JCrooks, PA bis-Azaaromatic quaternary ammonium analogues: ligands for alpha4beta2* and alpha7* subtypes of neuronal nicotinic receptors. Bioorg Med Chem Lett 12:3067-71 (2002)  
Target
Name:
Neuronal acetylcholine receptor subunit alpha-4/beta-2
Synonyms:
Neuronal acetylcholine receptor alpha4/beta2 Neuronal acetylcholine receptor; alpha4/beta2
Type:
Mol. Mass.:
Description:
Components:
This complex has 0 components.
Component 1
Name:
Neuronal acetylcholine receptor subunit alpha-4
Synonyms:
ACHA4_RAT Cholinergic, Nicotinic Alpha4Beta2 Chrna4 Neuronal acetylcholine receptor (alpha4beta2 nAChR) Neuronal acetylcholine receptor subunit alpha 4 beta 2 | Neuronal acetylcholine receptor subunit alpha-4
Type:
Enzyme
Mol. Mass.:
70196.44
Organism:
Rattus norvegicus (Rat)
Description:
P09483
Residue:
630
  
Component 2
Name:
Neuronal acetylcholine receptor subunit beta-2
Synonyms:
ACHB2_RAT Chrnb2 Neuronal acetylcholine receptor non-alpha-1 chain
Type:
Enzyme
Mol. Mass.:
56910.32
Organism:
Rattus norvegicus (Rat)
Description:
P12390
Residue:
500
  
Inhibitor
Name:
BDBM50119796
Synonyms:
1,1'-(hexane-1,6-diyl)diquinolinium iodide CHEMBL430870 | CHEMBL601410
Type:
Small organic molecule
Emp. Form.:
C24H26N2
Mol. Mass.:
342.4755
SMILES:
C(CCC[n+]1cccc2ccccc12)CC[n+]1cccc2ccccc12
: