Target
Neuronal acetylcholine receptor subunit alpha-7
Ligand
BDBM50119787
Substrate
Meas. Tech.
ChEBML_144178
Ki
2390±n/a nM
Citation
 Ayers, JTDwoskin, LPDeaciuc, AGGrinevich, VPZhu, JCrooks, PA bis-Azaaromatic quaternary ammonium analogues: ligands for alpha4beta2* and alpha7* subtypes of neuronal nicotinic receptors. Bioorg Med Chem Lett 12:3067-71 (2002)  
Target
Name:
Neuronal acetylcholine receptor subunit alpha-7
Synonyms:
ACHA7_RAT Cholinergic, Nicotinic Alpha7 Chrna7 Neuronal acetylcholine receptor (alpha7 nAChR) Neuronal acetylcholine receptor subunit alpha-7 Neuronal acetylcholine receptor subunit alpha-7 (nAChR)
Type:
Enzyme
Mol. Mass.:
56502.44
Organism:
Rattus norvegicus (Rat)
Description:
Q05941
Residue:
502
  
Inhibitor
Name:
BDBM50119787
Synonyms:
1,1''-(octane-1,8-diyl)diquinolinium iodide CHEMBL1761995 | CHEMBL276745
Type:
Small organic molecule
Emp. Form.:
C26H30N2
Mol. Mass.:
370.5287
SMILES:
C(CCCC[n+]1cccc2ccccc12)CCC[n+]1cccc2ccccc12
: