Target
Serine/threonine-protein phosphatase 2A 55 kDa regulatory subunit B
Ligand
BDBM50366474
Substrate
Meas. Tech.
ChEMBL_198006 (CHEMBL798983)
IC50
2100±n/a nM
Citation
 McCluskey, AKeane, MAWalkom, CCBowyer, MCSim, ATYoung, DJSakoff, JA The first two cantharidin analogues displaying PP1 selectivity. Bioorg Med Chem Lett 12:391-3 (2002)  
Target
Name:
Serine/threonine-protein phosphatase 2A 55 kDa regulatory subunit B
Synonyms:
Serine-threonine protein phosphatase 2A regulatory subunit
Type:
PROTEIN
Mol. Mass.:
49694.81
Organism:
Gallus gallus
Description:
ChEMBL_161937
Residue:
426
  
Inhibitor
Name:
BDBM50366474
Synonyms:
NORCANTHARIDIN
Type:
Small organic molecule
Emp. Form.:
C8H8O4
Mol. Mass.:
168.1467
SMILES:
O=C1OC(=O)[C@@H]2[C@H]3CC[C@@H](O3)[C@H]12
: