Target
Progesterone receptor
Ligand
BDBM50067678
Substrate
Meas. Tech.
ChEMBL_159075 (CHEMBL763207)
EC50
0.120000±n/a nM
Citation
 Zhang, PTerefenko, EAFensome, AZhang, ZZhu, YCohen, JWinneker, RWrobel, JYardley, J Potent nonsteroidal progesterone receptor agonists: synthesis and SAR study of 6-aryl benzoxazines. Bioorg Med Chem Lett 12:787-90 (2002)  
Target
Name:
Progesterone receptor
Synonyms:
NR3C3 PGR PRGR_HUMAN | progesterone
Type:
Protein
Mol. Mass.:
98979.52
Organism:
Homo sapiens (Human)
Description:
P06401
Residue:
933
  
Inhibitor
Name:
BDBM50067678
Synonyms:
(6alpha)-17-(Acetyloxy)-6-methylpreg-4-ene-3,20-dione 17-Acetoxy-6alpha-methylprogesterone 6-alpha-Methyl-17-alpha-acetoxyprogesterone 6alpha-Methyl-17-acetoxy progesterone 6alpha-Methyl-4-pregnene-3,20-dion-17alpha-ol acetate Medroxyacetate progesterone Methylacetoxyprogesterone US9271961, MPA | medroxyprogesterone acetate
Type:
Small organic molecule
Emp. Form.:
C24H34O4
Mol. Mass.:
386.5244
SMILES:
C[C@H]1C[C@H]2[C@@H]3CC[C@](OC(C)=O)(C(C)=O)[C@@]3(C)CC[C@@H]2[C@@]2(C)CCC(=O)C=C12
: