Target
Melanocyte-stimulating hormone receptor
Ligand
BDBM50111175
Substrate
Meas. Tech.
ChEBML_105842
Ki
2900±n/a nM
Citation
 Mutulis, FMutule, IWikberg, JE N-alkylaminoacids and their derivatives interact with melanocortin receptors. Bioorg Med Chem Lett 12:1039-42 (2002)  
Target
Name:
Melanocyte-stimulating hormone receptor
Synonyms:
MC1-R MSH-R MSHR_HUMAN Melanocortin receptor (M1 and M4) Melanocortin receptor 1 (MC1-R) | Melanocortin receptor 1 (MC1R)
Type:
Enzyme
Mol. Mass.:
34717.23
Organism:
Homo sapiens (Human)
Description:
Q01726
Residue:
317
  
Inhibitor
Name:
BDBM50111175
Synonyms:
(2S)-5-[(E)-[amino(azaniumyl)methylidene]amino]-N-(naphthalen-2-yl)-2-[(naphthalen-2-ylmethyl)amino]pentanamide N-Alkylaminoacid derivative
Type:
Small organic molecule
Emp. Form.:
C27H30N5O
Mol. Mass.:
440.5595
SMILES:
[NH3+]C(=N)NCCC[C@H](NCc1ccc2ccccc2c1)C(=O)Nc1ccc2ccccc2c1
: