Target
Reverse transcriptase/RNaseH
Ligand
BDBM50421604
Substrate
Meas. Tech.
ChEMBL_197276 (CHEMBL804263)
EC50
180±n/a nM
Citation
 Choo, HChong, YChu, CK The role of 2',3'-unsaturation on the antiviral activity of anti-HIV nucleosides against 3TC-resistant mutant (M184V). Bioorg Med Chem Lett 13:1993-6 (2003)  
Target
Name:
Reverse transcriptase/RNaseH
Synonyms:
HIV-1 Reverse Transcriptase RNase H Reverse transcriptase/RNaseH
Type:
PROTEIN
Mol. Mass.:
65229.15
Organism:
Human immunodeficiency virus 1
Description:
ChEMBL_1473730
Residue:
566
  
Inhibitor
Name:
BDBM50421604
Synonyms:
ACH-126443 | ELVUCITABINE
Type:
Small organic molecule
Emp. Form.:
C9H10FN3O3
Mol. Mass.:
227.1924
SMILES:
Nc1nc(=O)n(cc1F)[C@H]1O[C@@H](CO)C=C1
: