Target
Xanthine dehydrogenase/oxidase
Ligand
BDBM50131446
Substrate
Meas. Tech.
ChEBML_216934
IC50
102000±n/a nM
Citation
 Jagadeeshwar Rao, RTiwari, AKKumar, USReddy, SVAli, AZRao, JM Novel 3-O-acyl mesquitol analogues as free-radical scavengers and enzyme inhibitors: synthesis, biological evaluation and structure-activity relationship. Bioorg Med Chem Lett 13:2777-80 (2003)  
Target
Name:
Xanthine dehydrogenase/oxidase
Synonyms:
XD XDHA XO Xanthine dehydrogenase/oxidase | Xanthine oxidase
Type:
Enzyme
Mol. Mass.:
146441.21
Organism:
Homo sapiens (Human)
Description:
P47989
Residue:
1333
  
Inhibitor
Name:
BDBM50131446
Synonyms:
CHEMBL419512 | Tetradecanoic acid (2S,3R)-2-(3,4-dihydroxy-phenyl)-7,8-dihydroxy-chroman-3-yl ester
Type:
Small organic molecule
Emp. Form.:
C29H40O7
Mol. Mass.:
500.6237
SMILES:
CCCCCCCCCCCCCC(=O)O[C@@H]1Cc2ccc(O)c(O)c2O[C@H]1c1ccc(O)c(O)c1
: