Target
Prothrombin
Ligand
BDBM50131468
Substrate
Meas. Tech.
ChEBML_208517
Ki
0.400000±n/a nM
Citation
 Nantermet, PGBarrow, JCNewton, CLPellicore, JMYoung, MLewis, SDLucas, BJKrueger, JAMcMasters, DRYan, YKuo, LCVacca, JPSelnick, HG Design and synthesis of potent and selective macrocyclic thrombin inhibitors. Bioorg Med Chem Lett 13:2781-4 (2003)  
Target
Name:
Prothrombin
Synonyms:
Activation peptide fragment 1 Coagulation factor II Prothrombin precursor Thrombin heavy chain | Thrombin light chain
Type:
Protein
Mol. Mass.:
70029.57
Organism:
Homo sapiens (Human)
Description:
P00734
Residue:
622
  
Inhibitor
Name:
BDBM50131468
Synonyms:
(S)-24-Chloro-11-(R)-cyclohexyl-20-oxa-3,9,12,17-tetraaza-tricyclo[19.4.0.0*5,9*]pentacosa-1(21),22,24-triene-4,10,13,18-tetraone | CHEMBL93315
Type:
Small organic molecule
Emp. Form.:
C26H35ClN4O5
Mol. Mass.:
519.033
SMILES:
Clc1ccc2OCC(=O)NCCCC(=O)N[C@H](C3CCCCC3)C(=O)N3CCC[C@H]3C(=O)NCc2c1
: